Reaction Details
TargetHistamine H3 receptor
LigandBDBM50127830
Substrate/Competitorn/a
Meas. Tech.ChEBML_83646
Ki 28±n/a nM
Citation Chai, WBreitenbucher, JGKwok, ALi, XWong, VCarruthers, NILovenberg, TWMazur, CWilson, SJAxe, FUJones, TK Non-imidazole heterocyclic histamine H3 receptor antagonists. Bioorg Med Chem Lett13:1767-70 (2003) Histamine H3 receptor
Name:Histamine H3 receptor
Type:G Protein-Coupled Receptor (GPCR)
Mol. Mass.:48691.47
Organism:Homo sapiens (Human)
Description:Binding assays were using CHO cells stably expressing hH3R receptors.
Residue:445
BDBM50127830
NameBDBM50127830
Synonyms:6-Methyl-2-[4-(3-piperidin-1-yl-propoxy)-phenyl]-indolizine | CHEMBL299356
TypeSmall organic molecule
Emp. Form.C23H28N2O
Mol. Mass.348.4812
SMILESCc1ccc2cc(cn2c1)-c1ccc(OCCCN2CCCCC2)cc1