Reaction Details
TargetHistamine H3 receptor
LigandBDBM50127839
Substrate/Competitorn/a
Meas. Tech.ChEBML_83646
Ki 16±n/a nM
Citation Chai, WBreitenbucher, JGKwok, ALi, XWong, VCarruthers, NILovenberg, TWMazur, CWilson, SJAxe, FUJones, TK Non-imidazole heterocyclic histamine H3 receptor antagonists. Bioorg Med Chem Lett13:1767-70 (2003) Histamine H3 receptor
Name:Histamine H3 receptor
Type:G Protein-Coupled Receptor (GPCR)
Mol. Mass.:48691.47
Organism:Homo sapiens (Human)
Description:Binding assays were using CHO cells stably expressing hH3R receptors.
Residue:445
BDBM50127839
NameBDBM50127839
Synonyms:1-Methanesulfonyl-2-[4-(3-piperidin-1-yl-propoxy)-phenyl]-1H-indole | CHEMBL51877
TypeSmall organic molecule
Emp. Form.C23H28N2O3S
Mol. Mass.412.545
SMILESCS(=O)(=O)n1c(cc2ccccc12)-c1ccc(OCCCN2CCCCC2)cc1