Reaction Details
TargetTyrosine-protein kinase ABL2
LigandBDBM378885
Substrate/Competitorn/a
Meas. Tech.ChEMBL_2084890 (CHEMBL4766153)
IC50 4.0±n/a nM
Citation Zhang, CHChen, KJiao, YLi, LLLi, YPZhang, RJZheng, MWZhong, LHuang, SZSong, CLLin, WTYang, JXiang, RPeng, BHan, JHLu, GWWei, YQYang, SY From Lead to Drug Candidate: Optimization of 3-(Phenylethynyl)-1H-pyrazolo[3,4-d]pyrimidin-4-amine Derivatives as Agents for the Treatment of Triple Negative Breast Cancer. J Med Chem59:9788-9805 (2016) Tyrosine-protein kinase ABL2
Name:Tyrosine-protein kinase ABL2
Type:PROTEIN
Mol. Mass.:128360.63
Organism:Homo sapiens (Human)
Description:ChEMBL_325082
Residue:1182
BDBM378885
NameBDBM378885
Synonyms:US10266537, Compound 93
TypeSmall organic molecule
Emp. Form.C29H27F3N6O2
Mol. Mass.548.5589
SMILESCc1ccc(NC(=O)c2ccc(C)c(c2)C(F)(F)F)cc1C#Cc1nn([C@H]2CC[C@H](O)CC2)c2ncnc(N)c12