Reaction Details
TargetVasopressin V1a receptor
LigandBDBM50065130
Substrate/Competitorn/a
Meas. Tech.ChEBML_214555
IC50 26±n/a nM
Citation Sum, FWDusza, JSantos, EDGrosu, GReich, MDu, XAlbright, JDChan, PCoupet, JRu, XMazandarani, HSaunders, T Structure-activity study of novel tricyclic benzazepine arginine vasopressin antagonists. Bioorg Med Chem Lett13:2195-8 (2003) Vasopressin V1a receptor
Name:Vasopressin V1a receptor
Type:Enzyme Catalytic Domain
Mol. Mass.:47674.81
Organism:RAT
Description:VASOPRESSIN V1A AVPR1A RAT::P30560
Residue:424
BDBM50065130
NameBDBM50065130
Synonyms:CHEMBL71305 | N-[4-(5H,11H-Benzo[e]pyrrolo[1,2-a][1,4]diazepine-10-carbonyl)-phenyl]-2-trifluoromethyl-benzamide
TypeSmall organic molecule
Emp. Form.C27H20F3N3O2
Mol. Mass.475.4618
SMILESFC(F)(F)c1ccccc1C(=O)Nc1ccc(cc1)C(=O)N1Cc2cccn2Cc2ccccc12