Reaction Details
TargetTransient receptor potential cation channel subfamily V member 1
LigandBDBM50130546
Substrate/Competitorn/a
Meas. Tech.ChEMBL_215652 (CHEMBL820262)
Ki 25.2±n/a nM
Citation Lee, JLee, JKang, MShin, MKim, JMKang, SULim, JOChoi, HKSuh, YGPark, HGOh, UKim, HDPark, YHHa, HJKim, YHToth, AWang, YTran, RPearce, LVLundberg, DJBlumberg, PM N-(3-acyloxy-2-benzylpropyl)-N'-[4-(methylsulfonylamino)benzyl]thiourea analogues: novel potent and high affinity antagonists and partial antagonists of the vanilloid receptor. J Med Chem46:3116-26 (2003) 
 
Transient receptor potential cation channel subfamily V member 1
Name:Transient receptor potential cation channel subfamily V member 1
Type:Transient Receptor
Mol. Mass.:94956.12
Organism:Rattus norvegicus (rat)
Description:O35433
Residue:838
BDBM50130546
NameBDBM50130546
Synonyms:2,2-Dimethyl-propionic acid 2-(4-tert-butyl-benzyl)-3-[3-(4-methanesulfonylamino-3-methoxy-benzyl)-thioureido]-propyl ester | CHEMBL323435
TypeSmall organic molecule
Emp. Form.C29H43N3O5S2
Mol. Mass.577.799
SMILESCOc1cc(CNC(=S)NCC(COC(=O)C(C)(C)C)Cc2ccc(cc2)C(C)(C)C)ccc1NS(C)(=O)=O