Reaction Details
TargetTransient receptor potential cation channel subfamily V member 1
LigandBDBM20461
Substrate/Competitorn/a
Meas. Tech.ChEMBL_215654 (CHEMBL820264)
Ki 1700±n/a nM
Citation Lee, JLee, JKang, MShin, MKim, JMKang, SULim, JOChoi, HKSuh, YGPark, HGOh, UKim, HDPark, YHHa, HJKim, YHToth, AWang, YTran, RPearce, LVLundberg, DJBlumberg, PM N-(3-acyloxy-2-benzylpropyl)-N'-[4-(methylsulfonylamino)benzyl]thiourea analogues: novel potent and high affinity antagonists and partial antagonists of the vanilloid receptor. J Med Chem46:3116-26 (2003) 
 
Transient receptor potential cation channel subfamily V member 1
Name:Transient receptor potential cation channel subfamily V member 1
Type:Transient Receptor
Mol. Mass.:94956.12
Organism:Rattus norvegicus (rat)
Description:O35433
Residue:838
BDBM20461
NameBDBM20461
Synonyms:(6E)-N-[(4-hydroxy-3-methoxyphenyl)methyl]-8-methylnon-6-enamide CAP Capsaicin | Zostrix
Typen/a
Emp. Form.C18H27NO3
Mol. Mass.305.4119
SMILESCOc1cc(CNC(=O)CCCC\C=C\C(C)C)ccc1O