Reaction Details
TargetFibroblast growth factor receptor 2
LigandBDBM301217
Substrate/Competitorn/a
Meas. Tech.ChEMBL_2101742 (CHEMBL4810138)
IC50 0.150000±n/a nM
Citation Wu, LZhang, CHe, CQian, DLu, LSun, YXu, MZhuo, JLiu, PCCKlabe, RWynn, RCovington, MGallagher, KLeffet, LBowman, KDiamond, SKoblish, HZhang, YSoloviev, MHollis, GBurn, TCScherle, PYeleswaram, SHuber, RYao, W Discovery of Pemigatinib: A Potent and Selective Fibroblast Growth Factor Receptor (FGFR) Inhibitor. J Med Chem64:10666-10679 (2021) 
 
Fibroblast growth factor receptor 2
Name:Fibroblast growth factor receptor 2
Type:Enzyme
Mol. Mass.:92015.45
Organism:Homo sapiens (Human)
Description:P21802
Residue:821
BDBM301217
NameBDBM301217
Synonyms:3-(2,6-Difluoro-3,5-dimethoxyphenyl)-1-methyl-1,3,4,7-tetrahydro-2H-pyrrolo[3',2':5,6]pyrido[4,3-d]pyrimidin-2-one US11053246, Example 33 | US9611267, Example 33
TypeSmall organic molecule
Emp. Form.C18H16F2N4O3
Mol. Mass.374.3414
SMILESCOc1cc(OC)c(F)c(N2Cc3cnc4[nH]ccc4c3N(C)C2=O)c1F