Reaction Details
TargetPeroxisome proliferator-activated receptor gamma
LigandBDBM50075315
Substrate/Competitorn/a
Meas. Tech.ChEMBL_154192 (CHEMBL762741)
EC50 800±n/a nM
Citation Nomura, MTanase, TIde, TTsunoda, MSuzuki, MUchiki, HMurakami, KMiyachi, H Design, synthesis, and evaluation of substituted phenylpropanoic acid derivatives as human peroxisome proliferator activated receptor activators. Discovery of potent and human peroxisome proliferator activated receptor alpha subtype-selective activators. J Med Chem46:3581-99 (2003) 
 
Peroxisome proliferator-activated receptor gamma
Name:Peroxisome proliferator-activated receptor gamma
Type:Nuclear Receptor
Mol. Mass.:57613.46
Organism:Homo sapiens (Human)
Description:P37231
Residue:505
BDBM50075315
NameBDBM50075315
Synonyms:5-(2,4-Dioxo-thiazolidin-5-ylmethyl)-2-methoxy-N-(4-trifluoromethyl-benzyl)-benzamide CHEMBL24458 | KRP-297
TypeSmall organic molecule
Emp. Form.C20H17F3N2O4S
Mol. Mass.438.42
SMILESCOc1ccc(Cc2sc(=O)[nH]c2O)cc1C(=O)NCc1ccc(cc1)C(F)(F)F