Reaction Details
TargetRetinoic acid receptor gamma
LigandBDBM50129728
Substrate/Competitorn/a
Meas. Tech.ChEBML_196011
Ki 8566.0±n/a nM
Citation Gernert, DLAjamie, RArdecky, RABell, MGLeibowitz, MDMais, DAMapes, CMMichellys, PYRungta, DReifel-Miller, ATyhonas, JSYumibe, NGrese, TA Design and synthesis of fluorinated RXR modulators. Bioorg Med Chem Lett13:3191-5 (2003) Retinoic acid receptor gamma
Name:Retinoic acid receptor gamma
Type:PROTEIN
Mol. Mass.:50345.43
Organism:Homo sapiens (Human)
Description:ChEMBL_1458016
Residue:454
BDBM50129728
NameBDBM50129728
Synonyms:(2E,4E,6Z)-7-(3,5-Di-tert-butyl-2-ethoxy-phenyl)-3-methyl-octa-2,4,6-trienoic acid CHEMBL92050
TypeSmall organic molecule
Emp. Form.C25H36O3
Mol. Mass.384.5515
SMILESCCOc1c(cc(cc1C(C)(C)C)C(C)(C)C)C(\C)=C/C=C/C(/C)=C/C(O)=O