Reaction Details
TargetTelomerase reverse transcriptase
LigandBDBM50134000
Substrate/Competitorn/a
Meas. Tech.ChEMBL_210064 (CHEMBL813588)
EC50 90±n/a nM
Citation Harrison, RJCuesta, JChessari, GRead, MABasra, SKReszka, APMorrell, JGowan, SMIncles, CMTanious, FAWilson, WDKelland, LRNeidle, S Trisubstituted acridine derivatives as potent and selective telomerase inhibitors. J Med Chem46:4463-76 (2003) 
 
Telomerase reverse transcriptase
Name:Telomerase reverse transcriptase
Type:PROTEIN
Mol. Mass.:127099.03
Organism:Homo sapiens (Human)
Description:ChEMBL_1447029
Residue:1132
BDBM50134000
NameBDBM50134000
Synonyms:CHEMBL139287 N-[9-Cyclohexylamino-6-(3-pyrrolidin-1-yl-propionylamino)-acridin-3-yl]-3-pyrrolidin-1-yl-propionamide
TypeSmall organic molecule
Emp. Form.C33H44N6O2
Mol. Mass.556.7415
SMILESO=C(CCN1CCCC1)Nc1ccc2c(NC3CCCCC3)c3ccc(NC(=O)CCN4CCCC4)cc3nc2c1