Reaction Details
TargetGlycogen phosphorylase, liver form
LigandBDBM50135561
Substrate/Competitorn/a
Meas. Tech.ChEBML_70983
IC50 11±n/a nM
Citation Lu, ZBohn, JBergeron, RDeng, QEllsworth, KPGeissler, WMHarris, GMcCann, PEMcKeever, BMyers, RWSaperstein, RWilloughby, CAYao, JChapman, K A new class of glycogen phosphorylase inhibitors. Bioorg Med Chem Lett13:4125-8 (2003) Glycogen phosphorylase, liver form
Name:Glycogen phosphorylase, liver form
Type:Homodimer
Mol. Mass.:97153.98
Organism:Homo sapiens (Human)
Description:Dimers associate into a tetramer to form the enzymatically active phosphorylase A.
Residue:847
BDBM50135561
NameBDBM50135561
Synonyms:4-{3-Fluoro-2-[(4-methoxy-pyridine-2-carbonyl)-amino]-phenoxy}-phthalic acid | CHEMBL133603
TypeSmall organic molecule
Emp. Form.C21H15FN2O7
Mol. Mass.426.3514
SMILESCOc1ccnc(c1)C(=O)Nc1c(F)cccc1Oc1ccc(C(O)=O)c(c1)C(O)=O