Reaction Details
TargetGlycogen phosphorylase, muscle form
LigandBDBM50135567
Substrate/Competitorn/a
Meas. Tech.ChEBML_70984
IC50 80±n/a nM
Citation Lu, ZBohn, JBergeron, RDeng, QEllsworth, KPGeissler, WMHarris, GMcCann, PEMcKeever, BMyers, RWSaperstein, RWilloughby, CAYao, JChapman, K A new class of glycogen phosphorylase inhibitors. Bioorg Med Chem Lett13:4125-8 (2003) Glycogen phosphorylase, muscle form
Name:Glycogen phosphorylase, muscle form
Type:PROTEIN
Mol. Mass.:97097.45
Organism:Homo sapiens (Human)
Description:ChEMBL_1449751
Residue:842
BDBM50135567
NameBDBM50135567
Synonyms:4-{3-[(4-Trifluoromethyl-pyridine-2-carbonyl)-amino]-naphthalen-2-yloxy}-phthalic acid | CHEMBL337224
TypeSmall organic molecule
Emp. Form.C25H15F3N2O6
Mol. Mass.496.3916
SMILESOC(=O)c1ccc(Oc2cc3ccccc3cc2NC(=O)c2cc(ccn2)C(F)(F)F)cc1C(O)=O