Reaction Details
TargetGlycogen phosphorylase, muscle form
LigandBDBM50135568
Substrate/Competitorn/a
Meas. Tech.ChEBML_70984
IC50 140±n/a nM
Citation Lu, ZBohn, JBergeron, RDeng, QEllsworth, KPGeissler, WMHarris, GMcCann, PEMcKeever, BMyers, RWSaperstein, RWilloughby, CAYao, JChapman, K A new class of glycogen phosphorylase inhibitors. Bioorg Med Chem Lett13:4125-8 (2003) Glycogen phosphorylase, muscle form
Name:Glycogen phosphorylase, muscle form
Type:PROTEIN
Mol. Mass.:97097.45
Organism:Homo sapiens (Human)
Description:ChEMBL_1449751
Residue:842
BDBM50135568
NameBDBM50135568
Synonyms:4-[3-(3-Nitro-benzoylamino)-naphthalen-2-yloxy]-phthalic acid | CHEMBL442404
TypeSmall organic molecule
Emp. Form.C25H16N2O8
Mol. Mass.472.4031
SMILESOC(=O)c1ccc(Oc2cc3ccccc3cc2NC(=O)c2cccc(c2)[N+]([O-])=O)cc1C(O)=O