Reaction Details
TargetPeroxisome proliferator-activated receptor gamma
LigandBDBM28799
Substrate/Competitorn/a
Meas. Tech.ChEMBL_154186 (CHEMBL762735)
EC50 1900±n/a nM
Citation Xu, YMayhugh, DSaeed, AWang, XThompson, RCDominianni, SJKauffman, RFSingh, JBean, JSBensch, WRBarr, RJOsborne, JMontrose-Rafizadeh, CZink, RWYumibe, NPHuang, NLuffer-Atlas, DRungta, DMaise, DEMantlo, NB Design and synthesis of a potent and selective triazolone-based peroxisome proliferator-activated receptor alpha agonist. J Med Chem46:5121-4 (2003) 
 
Peroxisome proliferator-activated receptor gamma
Name:Peroxisome proliferator-activated receptor gamma
Type:Nuclear Receptor
Mol. Mass.:57613.46
Organism:Homo sapiens (Human)
Description:P37231
Residue:505
BDBM28799
NameBDBM28799
Synonyms:2-{[4-(2-{[(2,4-difluorophenyl)carbamoyl](heptyl)amino}ethyl)phenyl]sulfanyl}-2-methylpropanoic acid GW 9578 GW9578
TypeSmall organic molecule
Emp. Form.C26H34F2N2O3S
Mol. Mass.492.622
SMILESCCCCCCCN(CCc1ccc(SC(C)(C)C(O)=O)cc1)C(=O)Nc1ccc(F)cc1F