Reaction Details
TargetGenome polyprotein
LigandBDBM50137468
Substrate/Competitorn/a
Meas. Tech.ChEBML_164133
IC50>500000±n/a nM
Citation Beaulieu, PLBös, MBousquet, YFazal, GGauthier, JGillard, JGoulet, SLaPlante, SPoupart, MALefebvre, SMcKercher, GPellerin, CAustel, VKukolj, G Non-nucleoside inhibitors of the hepatitis C virus NS5B polymerase: discovery and preliminary SAR of benzimidazole derivatives. Bioorg Med Chem Lett14:119-24 (2003) Genome polyprotein
Name:Genome polyprotein
Type:PROTEIN
Mol. Mass.:246555.04
Organism:Poliovirus type 1 (strain Mahoney)
Description:ChEMBL_417449
Residue:2209
BDBM50137468
NameBDBM50137468
Synonyms:1-Cyclohexyl-2-pyridin-2-yl-1H-benzoimidazole-5-carboxylic acid 3,4-dimethoxy-benzylamide | CHEMBL366941
TypeSmall organic molecule
Emp. Form.C28H30N4O3
Mol. Mass.470.5628
SMILESCOc1ccc(CNC(=O)c2ccc3n(C4CCCCC4)c(nc3c2)-c2ccccn2)cc1OC