Reaction Details
TargetRNA-directed RNA polymerase
LigandBDBM50137852
Substrate/Competitorn/a
Meas. Tech.ChEBML_163993
IC50>50000±n/a nM
Citation Summa, VPetrocchi, APace, PMatassa, VGDe Francesco, RAltamura, STomei, LKoch, UNeuner, P Discovery of alpha,gamma-diketo acids as potent selective and reversible inhibitors of hepatitis C virus NS5b RNA-dependent RNA polymerase. J Med Chem47:14-7 (2003) 
 
RNA-directed RNA polymerase
Name:RNA-directed RNA polymerase
Type:Protein
Mol. Mass.:25173.95
Organism:Hepatitis C virus
Description:Q8JXU8
Residue:229
BDBM50137852
NameBDBM50137852
Synonyms:2,4-Dioxo-4-pyridin-3-yl-butyric acid | CHEMBL177297
TypeSmall organic molecule
Emp. Form.C9H7NO4
Mol. Mass.193.1562
SMILESOC(=O)C(=O)CC(=O)c1ccncc1