Reaction Details
TargetRNA-directed RNA polymerase
LigandBDBM50137857
Substrate/Competitorn/a
Meas. Tech.ChEBML_163993
IC50>50000±n/a nM
Citation Summa, VPetrocchi, APace, PMatassa, VGDe Francesco, RAltamura, STomei, LKoch, UNeuner, P Discovery of alpha,gamma-diketo acids as potent selective and reversible inhibitors of hepatitis C virus NS5b RNA-dependent RNA polymerase. J Med Chem47:14-7 (2003) 
 
RNA-directed RNA polymerase
Name:RNA-directed RNA polymerase
Type:Protein
Mol. Mass.:25173.95
Organism:Hepatitis C virus
Description:Q8JXU8
Residue:229
BDBM50137857
NameBDBM50137857
Synonyms:2-Hydroxy-4-oxo-4-phenyl-butyric acid CHEMBL177826
TypeSmall organic molecule
Emp. Form.C10H10O4
Mol. Mass.194.184
SMILESOC(CC(=O)c1ccccc1)C(O)=O