Reaction Details
TargetRNA-directed RNA polymerase
LigandBDBM50137874
Substrate/Competitorn/a
Meas. Tech.ChEBML_163993
IC50 3900±n/a nM
Citation Summa, VPetrocchi, APace, PMatassa, VGDe Francesco, RAltamura, STomei, LKoch, UNeuner, P Discovery of alpha,gamma-diketo acids as potent selective and reversible inhibitors of hepatitis C virus NS5b RNA-dependent RNA polymerase. J Med Chem47:14-7 (2003) 
 
RNA-directed RNA polymerase
Name:RNA-directed RNA polymerase
Type:Protein
Mol. Mass.:25173.95
Organism:Hepatitis C virus
Description:Q8JXU8
Residue:229
BDBM50137874
NameBDBM50137874
Synonyms:2,4-Dioxo-4-(2-propoxy-phenyl)-butyric acid | CHEMBL174910
TypeSmall organic molecule
Emp. Form.C13H14O5
Mol. Mass.250.2473
SMILESCCCOc1ccccc1C(=O)CC(=O)C(O)=O