Reaction Details
TargetReverse transcriptase/RNaseH
LigandBDBM50115579
Substrate/Competitorn/a
Meas. Tech.ChEBML_196372
IC50 54000±n/a nM
Citation Summa, VPetrocchi, APace, PMatassa, VGDe Francesco, RAltamura, STomei, LKoch, UNeuner, P Discovery of alpha,gamma-diketo acids as potent selective and reversible inhibitors of hepatitis C virus NS5b RNA-dependent RNA polymerase. J Med Chem47:14-7 (2003) 
 
Reverse transcriptase/RNaseH
Name:Reverse transcriptase/RNaseH
Type:PROTEIN
Mol. Mass.:65229.15
Organism:Human immunodeficiency virus 1
Description:ChEMBL_1473730
Residue:566
BDBM50115579
NameBDBM50115579
Synonyms:(Z)-2-hydroxy-4-oxo-4-phenyl-but-2-enoic acid 2-Hydroxy-4-oxo-4-phenyl-but-2-enoic acid (0.25H2O) CHEMBL19332 Sacchettini_CTRL
TypeSmall organic molecule
Emp. Form.C10H8O4
Mol. Mass.192.1681
SMILESOC(=O)C(=O)CC(=O)c1ccccc1