Reaction Details
TargetMelanocortin receptor 4
LigandBDBM50139036
Substrate/Competitorn/a
Meas. Tech.ChEMBL_106357 (CHEMBL714437)
Ki 170±n/a nM
Citation Richardson, TIOrnstein, PLBriner, KFisher, MJBacker, RTBiggers, CKClay, MPEmmerson, PJHertel, LWHsiung, HMHusain, SKahl, SDLee, JALindstrom, TDMartinelli, MJMayer, JPMullaney, JTO'Brien, TPPawlak, JMRevell, KDShah, JZgombick, JMHerr, RJMelekhov, ASampson, PBKing, CH Synthesis and structure-activity relationships of novel arylpiperazines as potent and selective agonists of the melanocortin subtype-4 receptor. J Med Chem47:744-55 (2004) 
 
Melanocortin receptor 4
Name:Melanocortin receptor 4
Type:Enzyme
Mol. Mass.:36949.50
Organism:Homo sapiens (Human)
Description:P32245
Residue:332
BDBM50139036
NameBDBM50139036
Synonyms:1,2,3,4-Tetrahydro-isoquinoline-3-carboxylic acid ((R)-1-(4-chloro-benzyl)-2-{4-[2-(1-methyl-1H-imidazol-2-ylmethyl)-phenyl]-piperazin-1-yl}-2-oxo-ethyl)-amide | CHEMBL353239
TypeSmall organic molecule
Emp. Form.C34H37ClN6O2
Mol. Mass.597.15
SMILESCn1ccnc1Cc1ccccc1N1CCN(CC1)C(=O)[C@@H](Cc1ccc(Cl)cc1)NC(=O)[C@H]1Cc2ccccc2CN1