Reaction Details
TargetMelanocortin receptor 4
LigandBDBM50139031
Substrate/Competitorn/a
Meas. Tech.ChEMBL_106357 (CHEMBL714437)
Ki 640±n/a nM
Citation Richardson, TIOrnstein, PLBriner, KFisher, MJBacker, RTBiggers, CKClay, MPEmmerson, PJHertel, LWHsiung, HMHusain, SKahl, SDLee, JALindstrom, TDMartinelli, MJMayer, JPMullaney, JTO'Brien, TPPawlak, JMRevell, KDShah, JZgombick, JMHerr, RJMelekhov, ASampson, PBKing, CH Synthesis and structure-activity relationships of novel arylpiperazines as potent and selective agonists of the melanocortin subtype-4 receptor. J Med Chem47:744-55 (2004) 
 
Melanocortin receptor 4
Name:Melanocortin receptor 4
Type:Enzyme
Mol. Mass.:36949.50
Organism:Homo sapiens (Human)
Description:P32245
Residue:332
BDBM50139031
NameBDBM50139031
Synonyms:1,2,3,4-Tetrahydro-isoquinoline-3-carboxylic acid {(R)-1-(4-chloro-benzyl)-2-oxo-2-[4-(2-phenoxy-phenyl)-piperazin-1-yl]-ethyl}-amide | CHEMBL165746
TypeSmall organic molecule
Emp. Form.C35H35ClN4O3
Mol. Mass.595.13
SMILESClc1ccc(C[C@@H](NC(=O)[C@H]2Cc3ccccc3CN2)C(=O)N2CCN(CC2)c2ccccc2Oc2ccccc2)cc1