Reaction Details
TargetMelanocyte-stimulating hormone receptor
LigandBDBM50134496
Substrate/Competitorn/a
Meas. Tech.ChEMBL_105840 (CHEMBL719017)
Ki 12000±n/a nM
Citation Richardson, TIOrnstein, PLBriner, KFisher, MJBacker, RTBiggers, CKClay, MPEmmerson, PJHertel, LWHsiung, HMHusain, SKahl, SDLee, JALindstrom, TDMartinelli, MJMayer, JPMullaney, JTO'Brien, TPPawlak, JMRevell, KDShah, JZgombick, JMHerr, RJMelekhov, ASampson, PBKing, CH Synthesis and structure-activity relationships of novel arylpiperazines as potent and selective agonists of the melanocortin subtype-4 receptor. J Med Chem47:744-55 (2004) 
 
Melanocyte-stimulating hormone receptor
Name:Melanocyte-stimulating hormone receptor
Type:Enzyme
Mol. Mass.:34717.23
Organism:Homo sapiens (Human)
Description:Q01726
Residue:317
BDBM50134496
NameBDBM50134496
Synonyms:(R)-1,2,3,4-Tetrahydro-isoquinoline-3-carboxylic acid {(R)-1-(4-chloro-benzyl)-2-[4-(2-methanesulfonylamino-phenyl)-piperazin-1-yl]-2-oxo-ethyl}-amide CHEMBL338594
TypeSmall organic molecule
Emp. Form.C30H34ClN5O4S
Mol. Mass.596.14
SMILESCS(=O)(=O)Nc1ccccc1N1CCN(CC1)C(=O)[C@@H](Cc1ccc(Cl)cc1)NC(=O)[C@H]1Cc2ccccc2CN1