Reaction Details
TargetPlasminogen
LigandBDBM50140407
Substrate/Competitorn/a
Meas. Tech.ChEBML_155588
IC50>10000±n/a nM
Citation Jia, ZJWu, YHuang, WZhang, PSong, YWoolfrey, JSinha, UArfsten, AEEdwards, STHutchaleelaha, AHollennbach, SJLambing, JLScarborough, RMZhu, BY 1-(2-Naphthyl)-1H-pyrazole-5-carboxylamides as potent factor Xa inhibitors. Part 3: Design, synthesis and SAR of orally bioavailable benzamidine-P4 inhibitors. Bioorg Med Chem Lett14:1229-34 (2004) 
 
Plasminogen
Name:Plasminogen
Type:Protein
Mol. Mass.:90541.87
Organism:Rattus norvegicus
Description:Q01177
Residue:812
BDBM50140407
NameBDBM50140407
Synonyms:2-(3-Fluoro-naphthalen-2-yl)-5-methyl-2H-pyrazole-3-carboxylic acid [4-(N,N-dimethyl-carbamimidoyl)-2-fluoro-phenyl]-amide | CHEMBL21140
TypeSmall organic molecule
Emp. Form.C24H21F2N5O
Mol. Mass.433.4532
SMILESCN(C)C(=N)c1ccc(NC(=O)c2cc(C)nn2-c2cc3ccccc3cc2F)c(F)c1