Reaction Details
TargetCoagulation factor X
LigandBDBM50140431
Substrate/Competitorn/a
Meas. Tech.ChEBML_48666
IC50 110±n/a nM
Citation Jia, ZJWu, YHuang, WZhang, PSong, YWoolfrey, JSinha, UArfsten, AEEdwards, STHutchaleelaha, AHollennbach, SJLambing, JLScarborough, RMZhu, BY 1-(2-Naphthyl)-1H-pyrazole-5-carboxylamides as potent factor Xa inhibitors. Part 3: Design, synthesis and SAR of orally bioavailable benzamidine-P4 inhibitors. Bioorg Med Chem Lett14:1229-34 (2004) 
 
Coagulation factor X
Name:Coagulation factor X
Type:Enzyme
Mol. Mass.:54726.60
Organism:Homo sapiens (Human)
Description:n/a
Residue:488
BDBM50140431
NameBDBM50140431
Synonyms:1-(3-Fluoro-naphthalen-2-yl)-1H-tetrazole-5-carboxylic acid [2-fluoro-4-(1-methyl-4,5-dihydro-1H-imidazol-2-yl)-phenyl]-amide | CHEMBL20673
TypeSmall organic molecule
Emp. Form.C22H17F2N7O
Mol. Mass.433.4135
SMILESCN1CCN=C1c1ccc(NC(=O)c2nnnn2-c2cc3ccccc3cc2F)c(F)c1