Reaction Details
TargetHistone-lysine N-methyltransferase EZH2
LigandBDBM172038
Substrate/Competitorn/a
Meas. Tech.ChEMBL_2124452 (CHEMBL4833685)
EC50 5.0±n/a nM
Citation Zhou, BLiang, XMei, HQi, SJiang, ZWang, AZou, FLiu, QLiu, JWang, WHu, CChen, YWang, ZWang, BWang, LLiu, JLiu, Q Discovery of IHMT-EZH2-115 as a Potent and Selective Enhancer of Zeste Homolog 2 (EZH2) Inhibitor for the Treatment of B-Cell Lymphomas. J Med Chem64:15170-15188 (2021) 
 
Histone-lysine N-methyltransferase EZH2
Name:Histone-lysine N-methyltransferase EZH2
Type:Protein
Mol. Mass.:85367.84
Organism:Homo sapiens (Human)
Description:Q15910
Residue:746
BDBM172038
NameBDBM172038
Synonyms:US10155002, Compound 44 US11052093, Compound 143 US9090562, 143 US9394283, 1
TypeSmall organic molecule
Emp. Form.C34H44N4O4
Mol. Mass.572.7376
SMILESCCN(C1CCOCC1)c1cc(cc(C(=O)NCc2c(C)cc(C)[nH]c2=O)c1C)-c1ccc(CN2CCOCC2)cc1