Reaction Details
TargetBeta-secretase 1
LigandBDBM50141551
Substrate/Competitorn/a
Meas. Tech.ChEMBL_41394 (CHEMBL653516)
IC50 3.4±n/a nM
Citation Kimura, TShuto, DKasai, SLiu, PHidaka, KHamada, THayashi, YHattori, CAsai, MKitazume, SSaido, TCIshiura, SKiso, Y KMI-358 and KMI-370, highly potent and small-sized BACE1 inhibitors containing phenylnorstatine. Bioorg Med Chem Lett14:1527-31 (2004) 
 
Beta-secretase 1
Name:Beta-secretase 1
Type:Protein
Mol. Mass.:55755.10
Organism:Homo sapiens (Human)
Description:P56817
Residue:501
BDBM50141551
NameBDBM50141551
Synonyms:5-[(S)-3-((S)-2-{(S)-2-[2-Amino-3-((S)-carboxyamino)-propionylamino]-3-methyl-butyrylamino}-4-methyl-pentanoylamino)-2-(R)-hydroxy-4-phenyl-butyrylamino]-isophthalic acid | CHEMBL288713
TypeSmall organic molecule
Emp. Form.C33H44N6O11
Mol. Mass.700.7361
SMILESCC(C)C[C@H](NC(=O)[C@@H](NC(=O)[C@@H](N)CNC(O)=O)C(C)C)C(=O)N[C@@H](Cc1ccccc1)[C@@H](O)C(=O)Nc1cc(cc(c1)C(O)=O)C(O)=O