Reaction Details
TargetFibroblast growth factor receptor 2
LigandBDBM50141811
Substrate/Competitorn/a
Meas. Tech.ChEBML_70635
IC50 260±n/a nM
Citation Shimizu, TFujiwara, YOsawa, TSakai, TKubo, KKubo, KNishitoba, TKimura, KSenga, TMurooka, HIwai, AFukushima, KYoshino, TMiwa, A Orally active anti-proliferation agents: novel diphenylamine derivatives as FGF-R2 autophosphorylation inhibitors. Bioorg Med Chem Lett14:875-9 (2004) 
 
Fibroblast growth factor receptor 2
Name:Fibroblast growth factor receptor 2
Type:Enzyme
Mol. Mass.:92015.45
Organism:Homo sapiens (Human)
Description:P21802
Residue:821
BDBM50141811
NameBDBM50141811
Synonyms:2-(2-{4-[4-(4-tert-Butyl-phenylamino)-3-fluoro-phenoxy]-6-methoxy-quinolin-7-yloxy}-ethylamino)-ethanol | CHEMBL354224
TypeSmall organic molecule
Emp. Form.C30H34FN3O4
Mol. Mass.519.6071
SMILESCOc1cc2c(Oc3ccc(Nc4ccc(cc4)C(C)(C)C)c(F)c3)ccnc2cc1OCCNCCO