Reaction Details
TargetFibroblast growth factor receptor 2
LigandBDBM50141813
Substrate/Competitorn/a
Meas. Tech.ChEBML_70635
IC50 71±n/a nM
Citation Shimizu, TFujiwara, YOsawa, TSakai, TKubo, KKubo, KNishitoba, TKimura, KSenga, TMurooka, HIwai, AFukushima, KYoshino, TMiwa, A Orally active anti-proliferation agents: novel diphenylamine derivatives as FGF-R2 autophosphorylation inhibitors. Bioorg Med Chem Lett14:875-9 (2004) 
 
Fibroblast growth factor receptor 2
Name:Fibroblast growth factor receptor 2
Type:Enzyme
Mol. Mass.:92015.45
Organism:Homo sapiens (Human)
Description:P21802
Residue:821
BDBM50141813
NameBDBM50141813
Synonyms:1-{4-[4-(4-tert-Butyl-phenylamino)-phenoxy]-6-methoxy-quinolin-7-yloxy}-3-morpholin-4-yl-propan-2-ol | CHEMBL168335
TypeSmall organic molecule
Emp. Form.C33H39N3O5
Mol. Mass.557.6799
SMILESCOc1cc2c(Oc3ccc(Nc4ccc(cc4)C(C)(C)C)cc3)ccnc2cc1OCC(O)CN1CCOCC1