Reaction Details
TargetFibroblast growth factor receptor 2
LigandBDBM50141814
Substrate/Competitorn/a
Meas. Tech.ChEBML_70635
IC50 200±n/a nM
Citation Shimizu, TFujiwara, YOsawa, TSakai, TKubo, KKubo, KNishitoba, TKimura, KSenga, TMurooka, HIwai, AFukushima, KYoshino, TMiwa, A Orally active anti-proliferation agents: novel diphenylamine derivatives as FGF-R2 autophosphorylation inhibitors. Bioorg Med Chem Lett14:875-9 (2004) 
 
Fibroblast growth factor receptor 2
Name:Fibroblast growth factor receptor 2
Type:Enzyme
Mol. Mass.:92015.45
Organism:Homo sapiens (Human)
Description:P21802
Residue:821
BDBM50141814
NameBDBM50141814
Synonyms:CHEMBL276125 | [4-(6,7-Dimethoxy-quinolin-4-yloxy)-phenyl]-(4-isopropyl-phenyl)-amine
TypeSmall organic molecule
Emp. Form.C26H26N2O3
Mol. Mass.414.4962
SMILESCOc1cc2nccc(Oc3ccc(Nc4ccc(cc4)C(C)C)cc3)c2cc1OC