Reaction Details
TargetFibroblast growth factor receptor 2
LigandBDBM50141817
Substrate/Competitorn/a
Meas. Tech.ChEBML_70635
IC50 23±n/a nM
Citation Shimizu, TFujiwara, YOsawa, TSakai, TKubo, KKubo, KNishitoba, TKimura, KSenga, TMurooka, HIwai, AFukushima, KYoshino, TMiwa, A Orally active anti-proliferation agents: novel diphenylamine derivatives as FGF-R2 autophosphorylation inhibitors. Bioorg Med Chem Lett14:875-9 (2004) 
 
Fibroblast growth factor receptor 2
Name:Fibroblast growth factor receptor 2
Type:Enzyme
Mol. Mass.:92015.45
Organism:Homo sapiens (Human)
Description:P21802
Residue:821
BDBM50141817
NameBDBM50141817
Synonyms:CHEMBL171509 | [1-(2-{4-[4-(4-tert-Butyl-phenylamino)-phenoxy]-6-methoxy-quinolin-7-yloxy}-ethyl)-piperidin-4-yl]-methanol
TypeSmall organic molecule
Emp. Form.C34H41N3O4
Mol. Mass.555.707
SMILESCOc1cc2c(Oc3ccc(Nc4ccc(cc4)C(C)(C)C)cc3)ccnc2cc1OCCN1CCC(CO)CC1