Reaction Details
TargetFibroblast growth factor receptor 2
LigandBDBM50141819
Substrate/Competitorn/a
Meas. Tech.ChEBML_70635
IC50 63±n/a nM
Citation Shimizu, TFujiwara, YOsawa, TSakai, TKubo, KKubo, KNishitoba, TKimura, KSenga, TMurooka, HIwai, AFukushima, KYoshino, TMiwa, A Orally active anti-proliferation agents: novel diphenylamine derivatives as FGF-R2 autophosphorylation inhibitors. Bioorg Med Chem Lett14:875-9 (2004) 
 
Fibroblast growth factor receptor 2
Name:Fibroblast growth factor receptor 2
Type:Enzyme
Mol. Mass.:92015.45
Organism:Homo sapiens (Human)
Description:P21802
Residue:821
BDBM50141819
NameBDBM50141819
Synonyms:(4-tert-Butyl-phenyl)-[4-(6,7-dimethoxy-quinolin-4-yloxy)-2-fluoro-phenyl]-amine | CHEMBL170907
TypeSmall organic molecule
Emp. Form.C27H27FN2O3
Mol. Mass.446.5133
SMILESCOc1cc2nccc(Oc3ccc(Nc4ccc(cc4)C(C)(C)C)c(F)c3)c2cc1OC