Reaction Details
TargetFibroblast growth factor receptor 2
LigandBDBM50141818
Substrate/Competitorn/a
Meas. Tech.ChEBML_70635
IC50>10000±n/a nM
Citation Shimizu, TFujiwara, YOsawa, TSakai, TKubo, KKubo, KNishitoba, TKimura, KSenga, TMurooka, HIwai, AFukushima, KYoshino, TMiwa, A Orally active anti-proliferation agents: novel diphenylamine derivatives as FGF-R2 autophosphorylation inhibitors. Bioorg Med Chem Lett14:875-9 (2004) 
 
Fibroblast growth factor receptor 2
Name:Fibroblast growth factor receptor 2
Type:Enzyme
Mol. Mass.:92015.45
Organism:Homo sapiens (Human)
Description:P21802
Residue:821
BDBM50141818
NameBDBM50141818
Synonyms:Biphenyl-3-yl-[4-(6,7-dimethoxy-quinolin-4-yloxy)-phenyl]-amine | CHEMBL353884
TypeSmall organic molecule
Emp. Form.C29H24N2O3
Mol. Mass.448.5125
SMILESCOc1cc2nccc(Oc3ccc(Nc4cccc(c4)-c4ccccc4)cc3)c2cc1OC