Reaction Details
TargetFibroblast growth factor receptor 2
LigandBDBM50141824
Substrate/Competitorn/a
Meas. Tech.ChEBML_70635
IC50 200±n/a nM
Citation Shimizu, TFujiwara, YOsawa, TSakai, TKubo, KKubo, KNishitoba, TKimura, KSenga, TMurooka, HIwai, AFukushima, KYoshino, TMiwa, A Orally active anti-proliferation agents: novel diphenylamine derivatives as FGF-R2 autophosphorylation inhibitors. Bioorg Med Chem Lett14:875-9 (2004) 
 
Fibroblast growth factor receptor 2
Name:Fibroblast growth factor receptor 2
Type:Enzyme
Mol. Mass.:92015.45
Organism:Homo sapiens (Human)
Description:P21802
Residue:821
BDBM50141824
NameBDBM50141824
Synonyms:(4-tert-Butyl-phenyl)-{4-[6-methoxy-7-(2-morpholin-4-yl-ethoxy)-quinolin-4-yloxy]-phenyl}-amine | CHEMBL354902
TypeSmall organic molecule
Emp. Form.C32H37N3O4
Mol. Mass.527.6539
SMILESCOc1cc2c(Oc3ccc(Nc4ccc(cc4)C(C)(C)C)cc3)ccnc2cc1OCCN1CCOCC1