Reaction Details
TargetFibroblast growth factor receptor 2
LigandBDBM50141823
Substrate/Competitorn/a
Meas. Tech.ChEBML_70635
IC50 71±n/a nM
Citation Shimizu, TFujiwara, YOsawa, TSakai, TKubo, KKubo, KNishitoba, TKimura, KSenga, TMurooka, HIwai, AFukushima, KYoshino, TMiwa, A Orally active anti-proliferation agents: novel diphenylamine derivatives as FGF-R2 autophosphorylation inhibitors. Bioorg Med Chem Lett14:875-9 (2004) 
 
Fibroblast growth factor receptor 2
Name:Fibroblast growth factor receptor 2
Type:Enzyme
Mol. Mass.:92015.45
Organism:Homo sapiens (Human)
Description:P21802
Residue:821
BDBM50141823
NameBDBM50141823
Synonyms:2-[(2-{4-[4-(4-tert-Butyl-phenylamino)-phenoxy]-6-methoxy-quinolin-7-yloxy}-ethyl)-(2-hydroxy-ethyl)-amino]-ethanol | CHEMBL414643
TypeSmall organic molecule
Emp. Form.C32H39N3O5
Mol. Mass.545.6692
SMILESCOc1cc2c(Oc3ccc(Nc4ccc(cc4)C(C)(C)C)cc3)ccnc2cc1OCCN(CCO)CCO