Reaction Details
TargetFibroblast growth factor receptor 2
LigandBDBM50141821
Substrate/Competitorn/a
Meas. Tech.ChEBML_70635
IC50 190±n/a nM
Citation Shimizu, TFujiwara, YOsawa, TSakai, TKubo, KKubo, KNishitoba, TKimura, KSenga, TMurooka, HIwai, AFukushima, KYoshino, TMiwa, A Orally active anti-proliferation agents: novel diphenylamine derivatives as FGF-R2 autophosphorylation inhibitors. Bioorg Med Chem Lett14:875-9 (2004) 
 
Fibroblast growth factor receptor 2
Name:Fibroblast growth factor receptor 2
Type:Enzyme
Mol. Mass.:92015.45
Organism:Homo sapiens (Human)
Description:P21802
Residue:821
BDBM50141821
NameBDBM50141821
Synonyms:(4-tert-Butyl-phenyl)-[4-(6,7-dimethoxy-quinolin-4-yloxy)-phenyl]-methanone | CHEMBL171413
TypeSmall organic molecule
Emp. Form.C28H27NO4
Mol. Mass.441.5183
SMILESCOc1cc2nccc(Oc3ccc(cc3)C(=O)c3ccc(cc3)C(C)(C)C)c2cc1OC