Reaction Details
TargetFibroblast growth factor receptor 2
LigandBDBM50141828
Substrate/Competitorn/a
Meas. Tech.ChEBML_70635
IC50 3400±n/a nM
Citation Shimizu, TFujiwara, YOsawa, TSakai, TKubo, KKubo, KNishitoba, TKimura, KSenga, TMurooka, HIwai, AFukushima, KYoshino, TMiwa, A Orally active anti-proliferation agents: novel diphenylamine derivatives as FGF-R2 autophosphorylation inhibitors. Bioorg Med Chem Lett14:875-9 (2004) 
 
Fibroblast growth factor receptor 2
Name:Fibroblast growth factor receptor 2
Type:Enzyme
Mol. Mass.:92015.45
Organism:Homo sapiens (Human)
Description:P21802
Residue:821
BDBM50141828
NameBDBM50141828
Synonyms:(4-tert-Butyl-cyclohexyl)-[4-(6,7-dimethoxy-quinolin-4-yloxy)-phenyl]-amine | CHEMBL352534
TypeSmall organic molecule
Emp. Form.C27H34N2O3
Mol. Mass.434.5705
SMILESCOc1cc2nccc(Oc3ccc(NC4CCC(CC4)C(C)(C)C)cc3)c2cc1OC