Reaction Details
TargetFibroblast growth factor receptor 2
LigandBDBM50141825
Substrate/Competitorn/a
Meas. Tech.ChEBML_70635
IC50 8900±n/a nM
Citation Shimizu, TFujiwara, YOsawa, TSakai, TKubo, KKubo, KNishitoba, TKimura, KSenga, TMurooka, HIwai, AFukushima, KYoshino, TMiwa, A Orally active anti-proliferation agents: novel diphenylamine derivatives as FGF-R2 autophosphorylation inhibitors. Bioorg Med Chem Lett14:875-9 (2004) 
 
Fibroblast growth factor receptor 2
Name:Fibroblast growth factor receptor 2
Type:Enzyme
Mol. Mass.:92015.45
Organism:Homo sapiens (Human)
Description:P21802
Residue:821
BDBM50141825
NameBDBM50141825
Synonyms:CHEMBL172746 | [4-(6,7-Dimethoxy-quinolin-4-yloxy)-phenyl]-phenyl-amine
TypeSmall organic molecule
Emp. Form.C23H20N2O3
Mol. Mass.372.4165
SMILESCOc1cc2nccc(Oc3ccc(Nc4ccccc4)cc3)c2cc1OC