Reaction Details
TargetFibroblast growth factor receptor 2
LigandBDBM50141826
Substrate/Competitorn/a
Meas. Tech.ChEBML_70635
IC50 780±n/a nM
Citation Shimizu, TFujiwara, YOsawa, TSakai, TKubo, KKubo, KNishitoba, TKimura, KSenga, TMurooka, HIwai, AFukushima, KYoshino, TMiwa, A Orally active anti-proliferation agents: novel diphenylamine derivatives as FGF-R2 autophosphorylation inhibitors. Bioorg Med Chem Lett14:875-9 (2004) 
 
Fibroblast growth factor receptor 2
Name:Fibroblast growth factor receptor 2
Type:Enzyme
Mol. Mass.:92015.45
Organism:Homo sapiens (Human)
Description:P21802
Residue:821
BDBM50141826
NameBDBM50141826
Synonyms:CHEMBL354830 | [4-(6,7-Dimethoxy-quinolin-4-yloxy)-phenyl]-(4-methoxy-phenyl)-amine
TypeSmall organic molecule
Emp. Form.C24H22N2O4
Mol. Mass.402.4425
SMILESCOc1ccc(Nc2ccc(Oc3ccnc4cc(OC)c(OC)cc34)cc2)cc1