Reaction Details
TargetFibroblast growth factor receptor 2
LigandBDBM50141827
Substrate/Competitorn/a
Meas. Tech.ChEBML_70635
IC50 440±n/a nM
Citation Shimizu, TFujiwara, YOsawa, TSakai, TKubo, KKubo, KNishitoba, TKimura, KSenga, TMurooka, HIwai, AFukushima, KYoshino, TMiwa, A Orally active anti-proliferation agents: novel diphenylamine derivatives as FGF-R2 autophosphorylation inhibitors. Bioorg Med Chem Lett14:875-9 (2004) 
 
Fibroblast growth factor receptor 2
Name:Fibroblast growth factor receptor 2
Type:Enzyme
Mol. Mass.:92015.45
Organism:Homo sapiens (Human)
Description:P21802
Residue:821
BDBM50141827
NameBDBM50141827
Synonyms:4-[4-(4-tert-Butyl-phenoxy)-phenoxy]-6,7-dimethoxy-quinoline | CHEMBL170415
TypeSmall organic molecule
Emp. Form.C27H27NO4
Mol. Mass.429.5076
SMILESCOc1cc2nccc(Oc3ccc(Oc4ccc(cc4)C(C)(C)C)cc3)c2cc1OC