Reaction Details
TargetVascular endothelial growth factor receptor 2
LigandBDBM50141809
Substrate/Competitorn/a
Meas. Tech.ChEBML_214114
IC50 83±n/a nM
Citation Shimizu, TFujiwara, YOsawa, TSakai, TKubo, KKubo, KNishitoba, TKimura, KSenga, TMurooka, HIwai, AFukushima, KYoshino, TMiwa, A Orally active anti-proliferation agents: novel diphenylamine derivatives as FGF-R2 autophosphorylation inhibitors. Bioorg Med Chem Lett14:875-9 (2004) 
 
Vascular endothelial growth factor receptor 2
Name:Vascular endothelial growth factor receptor 2
Type:Receptor Tyrosine Kinase
Mol. Mass.:151510.97
Organism:Homo sapiens (Human)
Description:P35968
Residue:1356
BDBM50141809
NameBDBM50141809
Synonyms:2-(2-{4-[4-(4-tert-Butyl-phenylamino)-phenoxy]-6-methoxy-quinolin-7-yloxy}-ethylamino)-ethanol | CHEMBL352308
TypeSmall organic molecule
Emp. Form.C30H35N3O4
Mol. Mass.501.6166
SMILESCOc1cc2c(Oc3ccc(Nc4ccc(cc4)C(C)(C)C)cc3)ccnc2cc1OCCNCCO