Reaction Details
TargetFibroblast growth factor receptor 2
LigandBDBM50141830
Substrate/Competitorn/a
Meas. Tech.ChEBML_70635
IC50>1000±n/a nM
Citation Shimizu, TFujiwara, YOsawa, TSakai, TKubo, KKubo, KNishitoba, TKimura, KSenga, TMurooka, HIwai, AFukushima, KYoshino, TMiwa, A Orally active anti-proliferation agents: novel diphenylamine derivatives as FGF-R2 autophosphorylation inhibitors. Bioorg Med Chem Lett14:875-9 (2004) 
 
Fibroblast growth factor receptor 2
Name:Fibroblast growth factor receptor 2
Type:Enzyme
Mol. Mass.:92015.45
Organism:Homo sapiens (Human)
Description:P21802
Residue:821
BDBM50141830
NameBDBM50141830
Synonyms:4-[4-(4-tert-Butyl-benzyl)-phenoxy]-6,7-dimethoxy-quinoline | CHEMBL353668
TypeSmall organic molecule
Emp. Form.C28H29NO3
Mol. Mass.427.5348
SMILESCOc1cc2nccc(Oc3ccc(Cc4ccc(cc4)C(C)(C)C)cc3)c2cc1OC