Reaction Details
TargetFibroblast growth factor receptor 2
LigandBDBM50141831
Substrate/Competitorn/a
Meas. Tech.ChEBML_70635
IC50 350±n/a nM
Citation Shimizu, TFujiwara, YOsawa, TSakai, TKubo, KKubo, KNishitoba, TKimura, KSenga, TMurooka, HIwai, AFukushima, KYoshino, TMiwa, A Orally active anti-proliferation agents: novel diphenylamine derivatives as FGF-R2 autophosphorylation inhibitors. Bioorg Med Chem Lett14:875-9 (2004) 
 
Fibroblast growth factor receptor 2
Name:Fibroblast growth factor receptor 2
Type:Enzyme
Mol. Mass.:92015.45
Organism:Homo sapiens (Human)
Description:P21802
Residue:821
BDBM50141831
NameBDBM50141831
Synonyms:(4-tert-Butyl-phenyl)-{4-[6-methoxy-7-(3-piperidin-1-yl-propoxy)-quinolin-4-yloxy]-phenyl}-amine | CHEMBL355436
TypeSmall organic molecule
Emp. Form.C34H41N3O3
Mol. Mass.539.7076
SMILESCOc1cc2c(Oc3ccc(Nc4ccc(cc4)C(C)(C)C)cc3)ccnc2cc1OCCCN1CCCCC1