Reaction Details
TargetFibroblast growth factor receptor 2
LigandBDBM50141832
Substrate/Competitorn/a
Meas. Tech.ChEBML_70635
IC50 130±n/a nM
Citation Shimizu, TFujiwara, YOsawa, TSakai, TKubo, KKubo, KNishitoba, TKimura, KSenga, TMurooka, HIwai, AFukushima, KYoshino, TMiwa, A Orally active anti-proliferation agents: novel diphenylamine derivatives as FGF-R2 autophosphorylation inhibitors. Bioorg Med Chem Lett14:875-9 (2004) 
 
Fibroblast growth factor receptor 2
Name:Fibroblast growth factor receptor 2
Type:Enzyme
Mol. Mass.:92015.45
Organism:Homo sapiens (Human)
Description:P21802
Residue:821
BDBM50141832
NameBDBM50141832
Synonyms:(4-tert-Butyl-phenyl)-[4-(6,7-dimethoxy-quinolin-4-yloxy)-2,3-dimethyl-phenyl]-amine | CHEMBL167425
TypeSmall organic molecule
Emp. Form.C29H32N2O3
Mol. Mass.456.576
SMILESCOc1cc2nccc(Oc3ccc(Nc4ccc(cc4)C(C)(C)C)c(C)c3C)c2cc1OC