Reaction Details
TargetRNA-directed RNA polymerase
LigandBDBM50137488
Substrate/Competitorn/a
Meas. Tech.ChEBML_143775
IC50 1600±n/a nM
Citation Beaulieu, PLBös, MBousquet, YDeRoy, PFazal, GGauthier, JGillard, JGoulet, SMcKercher, GPoupart, MAValois, SKukolj, G Non-nucleoside inhibitors of the hepatitis C virus NS5B polymerase: discovery of benzimidazole 5-carboxylic amide derivatives with low-nanomolar potency. Bioorg Med Chem Lett14:967-71 (2004) 
 
RNA-directed RNA polymerase
Name:RNA-directed RNA polymerase
Type:Protein
Mol. Mass.:25173.95
Organism:Hepatitis C virus
Description:Q8JXU8
Residue:229
BDBM50137488
NameBDBM50137488
Synonyms:1-Cyclohexyl-2-furan-3-yl-1H-benzoimidazole-5-carboxylic acid 1-cyclohexyl-2-furan-3-yl-1H-benzimidazole-5-carboxylic acid | CHEMBL175177
TypeSmall organic molecule
Emp. Form.C18H18N2O3
Mol. Mass.310.3471
SMILESOC(=O)c1ccc2n(C3CCCCC3)c(nc2c1)-c1ccoc1