Reaction Details
TargetRNA-directed RNA polymerase
LigandBDBM50142053
Substrate/Competitorn/a
Meas. Tech.ChEBML_143775
IC50 90±n/a nM
Citation Beaulieu, PLBös, MBousquet, YDeRoy, PFazal, GGauthier, JGillard, JGoulet, SMcKercher, GPoupart, MAValois, SKukolj, G Non-nucleoside inhibitors of the hepatitis C virus NS5B polymerase: discovery of benzimidazole 5-carboxylic amide derivatives with low-nanomolar potency. Bioorg Med Chem Lett14:967-71 (2004) 
 
RNA-directed RNA polymerase
Name:RNA-directed RNA polymerase
Type:Protein
Mol. Mass.:25173.95
Organism:Hepatitis C virus
Description:Q8JXU8
Residue:229
BDBM50142053
NameBDBM50142053
Synonyms:(S)-3-(5-Amino-1H-indol-3-yl)-2-[(1-cyclohexyl-2-furan-3-yl-1H-benzoimidazole-5-carbonyl)-amino]-propionic acid | CHEMBL175002
TypeSmall organic molecule
Emp. Form.C29H29N5O4
Mol. Mass.511.5717
SMILESNc1ccc2[nH]cc(C[C@H](NC(=O)c3ccc4n(C5CCCCC5)c(nc4c3)-c3ccoc3)C(O)=O)c2c1