Reaction Details
TargetCarboxypeptidase B2
LigandBDBM50575768
Substrate/Competitorn/a
Meas. Tech.ChEMBL_2125968 (CHEMBL4835313)
IC50 2.0±n/a nM
Citation Schaffner, APSansilvestri-Morel, PDespaux, NRuano, EPersigand, TRupin, AMennecier, PVallez, MORaimbaud, EDesos, PGloanec, P Phosphinanes and Azaphosphinanes as Potent and Selective Inhibitors of Activated Thrombin-Activatable Fibrinolysis Inhibitor (TAFIa). J Med Chem64:3897-3910 (2021) 
 
Carboxypeptidase B2
Name:Carboxypeptidase B2
Type:Enzyme
Mol. Mass.:48432.74
Organism:Homo sapiens (Human)
Description:Q96IY4
Residue:423
BDBM50575768
NameBDBM50575768
Synonyms:CHEMBL4846664
TypeSmall organic molecule
Emp. Form.C21H28N3O4P
Mol. Mass.417.4385
SMILESNCCCCC1(CN(Cc2ccccc2-c2cccnc2)CCP1(O)=O)C(O)=O