Reaction Details
TargetCarboxypeptidase B2
LigandBDBM50575775
Substrate/Competitorn/a
Meas. Tech.ChEMBL_2125968 (CHEMBL4835313)
IC50 5.0±n/a nM
Citation Schaffner, APSansilvestri-Morel, PDespaux, NRuano, EPersigand, TRupin, AMennecier, PVallez, MORaimbaud, EDesos, PGloanec, P Phosphinanes and Azaphosphinanes as Potent and Selective Inhibitors of Activated Thrombin-Activatable Fibrinolysis Inhibitor (TAFIa). J Med Chem64:3897-3910 (2021) 
 
Carboxypeptidase B2
Name:Carboxypeptidase B2
Type:Enzyme
Mol. Mass.:48432.74
Organism:Homo sapiens (Human)
Description:Q96IY4
Residue:423
BDBM50575775
NameBDBM50575775
Synonyms:CHEMBL4861532
TypeSmall organic molecule
Emp. Form.C20H26FN4O4P
Mol. Mass.436.417
SMILESNCCCC[C@]1(CN(Cc2ccc(F)cc2-c2cncnc2)CCP1(O)=O)C(O)=O