Reaction Details
TargetCarboxypeptidase B2
LigandBDBM50575776
Substrate/Competitorn/a
Meas. Tech.ChEMBL_2125968 (CHEMBL4835313)
IC50 1.000000±n/a nM
Citation Schaffner, APSansilvestri-Morel, PDespaux, NRuano, EPersigand, TRupin, AMennecier, PVallez, MORaimbaud, EDesos, PGloanec, P Phosphinanes and Azaphosphinanes as Potent and Selective Inhibitors of Activated Thrombin-Activatable Fibrinolysis Inhibitor (TAFIa). J Med Chem64:3897-3910 (2021) 
 
Carboxypeptidase B2
Name:Carboxypeptidase B2
Type:Enzyme
Mol. Mass.:48432.74
Organism:Homo sapiens (Human)
Description:Q96IY4
Residue:423
BDBM50575776
NameBDBM50575776
Synonyms:CHEMBL4868605
TypeSmall organic molecule
Emp. Form.C23H30FN2O4P
Mol. Mass.448.4675
SMILESCc1ccc(cc1)-c1cc(F)ccc1CN1CCP(O)(=O)[C@@](CCCCN)(C1)C(O)=O