Reaction Details
TargetCarboxypeptidase B2
LigandBDBM50575780
Substrate/Competitorn/a
Meas. Tech.ChEMBL_2125968 (CHEMBL4835313)
IC50 6.0±n/a nM
Citation Schaffner, APSansilvestri-Morel, PDespaux, NRuano, EPersigand, TRupin, AMennecier, PVallez, MORaimbaud, EDesos, PGloanec, P Phosphinanes and Azaphosphinanes as Potent and Selective Inhibitors of Activated Thrombin-Activatable Fibrinolysis Inhibitor (TAFIa). J Med Chem64:3897-3910 (2021) 
 
Carboxypeptidase B2
Name:Carboxypeptidase B2
Type:Enzyme
Mol. Mass.:48432.74
Organism:Homo sapiens (Human)
Description:Q96IY4
Residue:423
BDBM50575780
NameBDBM50575780
Synonyms:CHEMBL4878039
TypeSmall organic molecule
Emp. Form.C20H28FN4O4P
Mol. Mass.438.4329
SMILESCn1cncc1-c1cc(F)ccc1CN1CCP(O)(=O)[C@@](CCCCN)(C1)C(O)=O