Reaction Details
TargetPotassium voltage-gated channel subfamily KQT member 2
LigandBDBM50142346
Substrate/Competitorn/a
Meas. Tech.ChEBML_91709
EC50 663±n/a nM
Citation Hewawasam, PChen, NDing, MNatale, JTBoissard, CGYeola, SGribkoff, VKStarrett, JDworetzky, SI The synthesis and structure-activity relationships of 3-amino-4-benzylquinolin-2-ones; discovery of novel KCNQ2 channel openers. Bioorg Med Chem Lett14:1615-8 (2004) 
 
Potassium voltage-gated channel subfamily KQT member 2
Name:Potassium voltage-gated channel subfamily KQT member 2
Type:PROTEIN
Mol. Mass.:84494.02
Organism:Mus musculus
Description:ChEMBL_990142
Residue:759
BDBM50142346
NameBDBM50142346
Synonyms:CHEMBL41078 | N-[4-(5-Chloro-2-hydroxy-benzyl)-2-oxo-6-trifluoromethyl-1,2-dihydro-quinolin-3-yl]-C,C,C-trifluoro-methanesulfonamide
TypeSmall organic molecule
Emp. Form.C18H11ClF6N2O4S
Mol. Mass.500.799
SMILESOc1ccc(Cl)cc1Cc1c(NS(=O)(=O)C(F)(F)F)c(=O)[nH]c2ccc(cc12)C(F)(F)F